bulix.org / pastebin

Private paste #85084: Untitled ASCII paste by 176.62.209.28

This file contains any messages produced by compilers while
running configure, to aid debugging if configure makes a mistake.

It was created by glib configure 2.36.3, which was
generated by GNU Autoconf 2.69.  Invocation command line was

  $ ./configure --target=arm-buildroot-linux-uclibcgnueabi --host=arm-buildroot-linux-uclibcgnueabi --build=x86_64-unknown-linux-gnu --prefix=/usr --exec-prefix=/usr --sysconfdir=/etc --program-prefix= --disable-gtk-doc --disable-doc --disable-docs --disable-documentation --with-xmlto=no --with-fop=no --disable-nls --disable-largefile --enable-ipv6 --enable-static --enable-shared --disable-modular-tests --with-libiconv=gnu --with-pcre=internal

## --------- ##
## Platform. ##
## --------- ##

hostname = mpfj-nanobone
uname -m = x86_64
uname -r = 3.2.0-56-generic
uname -s = Linux
uname -v = #86-Ubuntu SMP Wed Oct 23 09:20:45 UTC 2013

/usr/bin/uname -p = unknown
/bin/uname -X     = unknown

/bin/arch              = unknown
/usr/bin/arch -k       = unknown
/usr/convex/getsysinfo = unknown
/usr/bin/hostinfo      = unknown
/bin/machine           = unknown
/usr/bin/oslevel       = unknown
/bin/universe          = unknown

PATH: /home/mpfj/buildroot-bt/output/host/bin
PATH: /home/mpfj/buildroot-bt/output/host/usr/bin
PATH: /home/mpfj/buildroot-bt/output/host/usr/sbin/
PATH: /usr/lib/lightdm/lightdm
PATH: /usr/local/sbin
PATH: /usr/local/bin
PATH: /usr/sbin
PATH: /usr/bin
PATH: /sbin
PATH: /bin
PATH: /usr/games
PATH: /home/mpfj/buildroot/output/host/usr/bin


## ----------- ##
## Core tests. ##
## ----------- ##

configure:2992: checking for a BSD-compatible install
configure:3060: result: /usr/bin/install -c
configure:3071: checking whether build environment is sane
configure:3126: result: yes
configure:3185: checking for arm-buildroot-linux-uclibcgnueabi-strip
configure:3212: result: /home/mpfj/buildroot-bt/output/host/usr/bin/arm-buildroot-linux-uclibcgnueabi-strip
configure:3277: checking for a thread-safe mkdir -p
configure:3316: result: /bin/mkdir -p
configure:3323: checking for gawk
configure:3353: result: no
configure:3323: checking for mawk
configure:3339: found /usr/bin/mawk
configure:3350: result: mawk
configure:3361: checking whether make sets $(MAKE)
configure:3383: result: yes
configure:3455: checking how to create a ustar tar archive
configure:3468: tar --version
tar (GNU tar) 1.26
Copyright (C) 2011 Free Software Foundation, Inc.
License GPLv3+: GNU GPL version 3 or later <http://gnu.org/licenses/gpl.html>.
This is free software: you are free to change and redistribute it.
There is NO WARRANTY, to the extent permitted by law.

Written by John Gilmore and Jay Fenlason.
configure:3471: $? = 0
configure:3511: tardir=conftest.dir && eval tar --format=ustar -chf - "$tardir" >conftest.tar
configure:3514: $? = 0
configure:3518: tar -xf - <conftest.tar
configure:3521: $? = 0
configure:3534: result: gnutar
configure:3542: checking whether to enable maintainer-specific portions of Makefiles
configure:3551: result: yes
configure:3579: checking whether make supports nested variables
configure:3596: result: yes
configure:3658: checking for arm-buildroot-linux-uclibcgnueabi-gcc
configure:3685: result: /home/mpfj/buildroot-bt/output/host/usr/bin/arm-buildroot-linux-uclibcgnueabi-gcc
configure:3954: checking for C compiler version
configure:3963: /home/mpfj/buildroot-bt/output/host/usr/bin/arm-buildroot-linux-uclibcgnueabi-gcc --version >&5
arm-buildroot-linux-uclibcgnueabi-gcc (Buildroot 2013.11-rc3) 4.8.2
Copyright (C) 2013 Free Software Foundation, Inc.
This is free software; see the source for copying conditions.  There is NO
warranty; not even for MERCHANTABILITY or FITNESS FOR A PARTICULAR PURPOSE.

configure:3974: $? = 0
configure:3963: /home/mpfj/buildroot-bt/output/host/usr/bin/arm-buildroot-linux-uclibcgnueabi-gcc -v >&5
Using built-in specs.
COLLECT_GCC=/home/mpfj/buildroot-bt/output/host/usr/bin/arm-buildroot-linux-uclibcgnueabi-gcc
COLLECT_LTO_WRAPPER=/home/mpfj/buildroot-bt/output/host/usr/libexec/gcc/arm-buildroot-linux-uclibcgnueabi/4.8.2/lto-wrapper
Target: arm-buildroot-linux-uclibcgnueabi
Configured with: ./configure --prefix=/home/mpfj/buildroot-bt/output/host/usr --sysconfdir=/home/mpfj/buildroot-bt/output/host/etc --enable-shared --disable-static --disable-gtk-doc --disable-doc --disable-docs --disable-documentation --with-xmlto=no --with-fop=no --target=arm-buildroot-linux-uclibcgnueabi --with-sysroot=/home/mpfj/buildroot-bt/output/host/usr/arm-buildroot-linux-uclibcgnueabi/sysroot --disable-__cxa_atexit --with-gnu-ld --disable-libssp --disable-multilib --with-gmp=/home/mpfj/buildroot-bt/output/host/usr --with-mpfr=/home/mpfj/buildroot-bt/output/host/usr --enable-target-optspace --disable-tls --disable-libmudflap --enable-threads --with-mpc=/home/mpfj/buildroot-bt/output/host/usr --disable-decimal-float --with-arch=armv7-a --with-tune=cortex-a8 --with-abi=aapcs-linux --with-fpu=vfpv3-d16 --with-float=softfp --with-mode=arm --with-pkgversion='Buildroot 2013.11-rc3' --with-bugurl=http://bugs.buildroot.net/ --enable-languages=c,c++ --disable-largefile --with-build-time-tools=/home/mpfj/buildroot-bt/output/host/usr/arm-buildroot-linux-uclibcgnueabi/bin --disable-libgomp --with-fpu=vfpv3 --with-float=hard
Thread model: posix
gcc version 4.8.2 (Buildroot 2013.11-rc3) 
configure:3974: $? = 0
configure:3963: /home/mpfj/buildroot-bt/output/host/usr/bin/arm-buildroot-linux-uclibcgnueabi-gcc -V >&5
arm-buildroot-linux-uclibcgnueabi-gcc: error: unrecognized command line option '-V'
arm-buildroot-linux-uclibcgnueabi-gcc: fatal error: no input files
compilation terminated.
configure:3974: $? = 1
configure:3963: /home/mpfj/buildroot-bt/output/host/usr/bin/arm-buildroot-linux-uclibcgnueabi-gcc -qversion >&5
arm-buildroot-linux-uclibcgnueabi-gcc: error: unrecognized command line option '-qversion'
arm-buildroot-linux-uclibcgnueabi-gcc: fatal error: no input files
compilation terminated.
configure:3974: $? = 1
configure:3994: checking whether the C compiler works
configure:4016: /home/mpfj/buildroot-bt/output/host/usr/bin/arm-buildroot-linux-uclibcgnueabi-gcc   -pipe -Os    conftest.c  >&5
configure:4020: $? = 0
configure:4068: result: yes
configure:4071: checking for C compiler default output file name
configure:4073: result: a.out
configure:4079: checking for suffix of executables
configure:4086: /home/mpfj/buildroot-bt/output/host/usr/bin/arm-buildroot-linux-uclibcgnueabi-gcc -o conftest   -pipe -Os    conftest.c  >&5
configure:4090: $? = 0
configure:4112: result: 
configure:4134: checking whether we are cross compiling
configure:4172: result: yes
configure:4177: checking for suffix of object files
configure:4199: /home/mpfj/buildroot-bt/output/host/usr/bin/arm-buildroot-linux-uclibcgnueabi-gcc -c   -pipe -Os   conftest.c >&5
configure:4203: $? = 0
configure:4224: result: o
configure:4228: checking whether we are using the GNU C compiler
configure:4247: /home/mpfj/buildroot-bt/output/host/usr/bin/arm-buildroot-linux-uclibcgnueabi-gcc -c   -pipe -Os   conftest.c >&5
configure:4247: $? = 0
configure:4256: result: yes
configure:4265: checking whether /home/mpfj/buildroot-bt/output/host/usr/bin/arm-buildroot-linux-uclibcgnueabi-gcc accepts -g
configure:4285: /home/mpfj/buildroot-bt/output/host/usr/bin/arm-buildroot-linux-uclibcgnueabi-gcc -c -g  conftest.c >&5
configure:4285: $? = 0
configure:4326: result: yes
configure:4343: checking for /home/mpfj/buildroot-bt/output/host/usr/bin/arm-buildroot-linux-uclibcgnueabi-gcc option to accept ISO C89
configure:4406: /home/mpfj/buildroot-bt/output/host/usr/bin/arm-buildroot-linux-uclibcgnueabi-gcc  -c   -pipe -Os   conftest.c >&5
configure:4406: $? = 0
configure:4419: result: none needed
configure:4450: checking for style of include used by make
configure:4478: result: GNU
configure:4504: checking dependency style of /home/mpfj/buildroot-bt/output/host/usr/bin/arm-buildroot-linux-uclibcgnueabi-gcc
configure:4615: result: gcc3
configure:4635: checking how to run the C preprocessor
configure:4705: result: /home/mpfj/buildroot-bt/output/host/usr/bin/arm-buildroot-linux-uclibcgnueabi-cpp
configure:4725: /home/mpfj/buildroot-bt/output/host/usr/bin/arm-buildroot-linux-uclibcgnueabi-cpp  conftest.c
configure:4725: $? = 0
configure:4739: /home/mpfj/buildroot-bt/output/host/usr/bin/arm-buildroot-linux-uclibcgnueabi-cpp  conftest.c
conftest.c:14:28: fatal error: ac_nonexistent.h: No such file or directory
 #include <ac_nonexistent.h>
                            ^
compilation terminated.
configure:4739: $? = 1
configure: failed program was:
| /* confdefs.h */
| #define PACKAGE_NAME "glib"
| #define PACKAGE_TARNAME "glib"
| #define PACKAGE_VERSION "2.36.3"
| #define PACKAGE_STRING "glib 2.36.3"
| #define PACKAGE_BUGREPORT "http://bugzilla.gnome.org/enter_bug.cgi?product=glib"
| #define PACKAGE_URL ""
| #define GLIB_MAJOR_VERSION 2
| #define GLIB_MINOR_VERSION 36
| #define GLIB_MICRO_VERSION 3
| #define GLIB_INTERFACE_AGE 3
| #define GLIB_BINARY_AGE 3603
| /* end confdefs.h.  */
| #include <ac_nonexistent.h>
configure:4781: checking build system type
configure:4795: result: x86_64-unknown-linux-gnu
configure:4815: checking host system type
configure:4828: result: arm-buildroot-linux-uclibcgnueabi
configure:4849: checking for the BeOS
configure:4859: result: no
configure:4863: checking for Win32
configure:4901: result: no
configure:4907: checking for Mac OS X Carbon support
configure:4918: /home/mpfj/buildroot-bt/output/host/usr/bin/arm-buildroot-linux-uclibcgnueabi-cpp  conftest.c
conftest.c:15:27: fatal error: Carbon/Carbon.h: No such file or directory
 #include <Carbon/Carbon.h>
                           ^
compilation terminated.
configure:4918: $? = 1
configure: failed program was:
| /* confdefs.h */
| #define PACKAGE_NAME "glib"
| #define PACKAGE_TARNAME "glib"
| #define PACKAGE_VERSION "2.36.3"
| #define PACKAGE_STRING "glib 2.36.3"
| #define PACKAGE_BUGREPORT "http://bugzilla.gnome.org/enter_bug.cgi?product=glib"
| #define PACKAGE_URL ""
| #define GLIB_MAJOR_VERSION 2
| #define GLIB_MINOR_VERSION 36
| #define GLIB_MICRO_VERSION 3
| #define GLIB_INTERFACE_AGE 3
| #define GLIB_BINARY_AGE 3603
| /* end confdefs.h.  */
| 
| #include <Carbon/Carbon.h>
| #include <CoreServices/CoreServices.h>
| 
configure:4923: result: no
configure:4927: checking for Mac OS X Cocoa support
configure:4938: /home/mpfj/buildroot-bt/output/host/usr/bin/arm-buildroot-linux-uclibcgnueabi-cpp  conftest.c
conftest.c:15:25: fatal error: Cocoa/Cocoa.h: No such file or directory
 #include <Cocoa/Cocoa.h>
                         ^
compilation terminated.
configure:4938: $? = 1
configure: failed program was:
| /* confdefs.h */
| #define PACKAGE_NAME "glib"
| #define PACKAGE_TARNAME "glib"
| #define PACKAGE_VERSION "2.36.3"
| #define PACKAGE_STRING "glib 2.36.3"
| #define PACKAGE_BUGREPORT "http://bugzilla.gnome.org/enter_bug.cgi?product=glib"
| #define PACKAGE_URL ""
| #define GLIB_MAJOR_VERSION 2
| #define GLIB_MINOR_VERSION 36
| #define GLIB_MICRO_VERSION 3
| #define GLIB_INTERFACE_AGE 3
| #define GLIB_BINARY_AGE 3603
| /* end confdefs.h.  */
| 
| #include <Cocoa/Cocoa.h>
| #ifdef GNUSTEP_BASE_VERSION
| #error "Detected GNUstep, not Cocoa"
| #endif
| 
configure:4943: result: no
configure:5436: checking for grep that handles long lines and -e
configure:5494: result: /bin/grep
configure:5499: checking for egrep
configure:5561: result: /bin/grep -E
configure:5567: checking whether we are using the GNU C Library 2.1 or newer
configure:5594: result: yes
configure:5653: checking whether to enable garbage collector friendliness
configure:5664: result: no
configure:5668: checking whether to disable memory pools
configure:5672: result: no
configure:5711: checking for arm-buildroot-linux-uclibcgnueabi-c++
configure:5738: result: /home/mpfj/buildroot-bt/output/host/usr/bin/arm-buildroot-linux-uclibcgnueabi-g++
configure:5925: checking for C++ compiler version
configure:5934: /home/mpfj/buildroot-bt/output/host/usr/bin/arm-buildroot-linux-uclibcgnueabi-g++ --version >&5
arm-buildroot-linux-uclibcgnueabi-g++ (Buildroot 2013.11-rc3) 4.8.2
Copyright (C) 2013 Free Software Foundation, Inc.
This is free software; see the source for copying conditions.  There is NO
warranty; not even for MERCHANTABILITY or FITNESS FOR A PARTICULAR PURPOSE.

configure:5945: $? = 0
configure:5934: /home/mpfj/buildroot-bt/output/host/usr/bin/arm-buildroot-linux-uclibcgnueabi-g++ -v >&5
Using built-in specs.
COLLECT_GCC=/home/mpfj/buildroot-bt/output/host/usr/bin/arm-buildroot-linux-uclibcgnueabi-g++
COLLECT_LTO_WRAPPER=/home/mpfj/buildroot-bt/output/host/usr/libexec/gcc/arm-buildroot-linux-uclibcgnueabi/4.8.2/lto-wrapper
Target: arm-buildroot-linux-uclibcgnueabi
Configured with: ./configure --prefix=/home/mpfj/buildroot-bt/output/host/usr --sysconfdir=/home/mpfj/buildroot-bt/output/host/etc --enable-shared --disable-static --disable-gtk-doc --disable-doc --disable-docs --disable-documentation --with-xmlto=no --with-fop=no --target=arm-buildroot-linux-uclibcgnueabi --with-sysroot=/home/mpfj/buildroot-bt/output/host/usr/arm-buildroot-linux-uclibcgnueabi/sysroot --disable-__cxa_atexit --with-gnu-ld --disable-libssp --disable-multilib --with-gmp=/home/mpfj/buildroot-bt/output/host/usr --with-mpfr=/home/mpfj/buildroot-bt/output/host/usr --enable-target-optspace --disable-tls --disable-libmudflap --enable-threads --with-mpc=/home/mpfj/buildroot-bt/output/host/usr --disable-decimal-float --with-arch=armv7-a --with-tune=cortex-a8 --with-abi=aapcs-linux --with-fpu=vfpv3-d16 --with-float=softfp --with-mode=arm --with-pkgversion='Buildroot 2013.11-rc3' --with-bugurl=http://bugs.buildroot.net/ --enable-languages=c,c++ --disable-largefile --with-build-time-tools=/home/mpfj/buildroot-bt/output/host/usr/arm-buildroot-linux-uclibcgnueabi/bin --disable-libgomp --with-fpu=vfpv3 --with-float=hard
Thread model: posix
gcc version 4.8.2 (Buildroot 2013.11-rc3) 
configure:5945: $? = 0
configure:5934: /home/mpfj/buildroot-bt/output/host/usr/bin/arm-buildroot-linux-uclibcgnueabi-g++ -V >&5
arm-buildroot-linux-uclibcgnueabi-g++: error: unrecognized command line option '-V'
arm-buildroot-linux-uclibcgnueabi-g++: fatal error: no input files
compilation terminated.
configure:5945: $? = 1
configure:5934: /home/mpfj/buildroot-bt/output/host/usr/bin/arm-buildroot-linux-uclibcgnueabi-g++ -qversion >&5
arm-buildroot-linux-uclibcgnueabi-g++: error: unrecognized command line option '-qversion'
arm-buildroot-linux-uclibcgnueabi-g++: fatal error: no input files
compilation terminated.
configure:5945: $? = 1
configure:5949: checking whether we are using the GNU C++ compiler
configure:5968: /home/mpfj/buildroot-bt/output/host/usr/bin/arm-buildroot-linux-uclibcgnueabi-g++ -c   -pipe -Os   conftest.cpp >&5
configure:5968: $? = 0
configure:5977: result: yes
configure:5986: checking whether /home/mpfj/buildroot-bt/output/host/usr/bin/arm-buildroot-linux-uclibcgnueabi-g++ accepts -g
configure:6006: /home/mpfj/buildroot-bt/output/host/usr/bin/arm-buildroot-linux-uclibcgnueabi-g++ -c -g  conftest.cpp >&5
configure:6006: $? = 0
configure:6047: result: yes
configure:6072: checking dependency style of /home/mpfj/buildroot-bt/output/host/usr/bin/arm-buildroot-linux-uclibcgnueabi-g++
configure:6183: result: gcc3
configure:6210: /home/mpfj/buildroot-bt/output/host/usr/bin/arm-buildroot-linux-uclibcgnueabi-g++ -c   -pipe -Os   conftest.cpp >&5
configure:6210: $? = 0
configure:6232: checking whether /home/mpfj/buildroot-bt/output/host/usr/bin/arm-buildroot-linux-uclibcgnueabi-gcc and cc understand -c and -o together
configure:6263: /home/mpfj/buildroot-bt/output/host/usr/bin/arm-buildroot-linux-uclibcgnueabi-gcc -c conftest.c -o conftest2.o >&5
configure:6267: $? = 0
configure:6273: /home/mpfj/buildroot-bt/output/host/usr/bin/arm-buildroot-linux-uclibcgnueabi-gcc -c conftest.c -o conftest2.o >&5
configure:6277: $? = 0
configure:6288: cc -c conftest.c >&5
configure:6292: $? = 0
configure:6300: cc -c conftest.c -o conftest2.o >&5
configure:6304: $? = 0
configure:6310: cc -c conftest.c -o conftest2.o >&5
configure:6314: $? = 0
configure:6332: result: yes
configure:6669: checking pkg-config is at least version 0.16
configure:6672: result: yes
configure:6746: checking for gawk
configure:6773: result: mawk
configure:6788: checking for perl5
configure:6818: result: no
configure:6788: checking for perl
configure:6804: found /usr/bin/perl
configure:6815: result: perl
configure:6829: checking for indent
configure:6859: result: no
configure:6878: checking for perl
configure:6896: found /usr/bin/perl
configure:6908: result: /usr/bin/perl
configure:6969: checking for a Python interpreter with version >= 2.5
configure:6986: python -c import sys # split strings by '.' and convert to numeric. Append some zeros # because we need at least 4 digits for the hex conversion. # map returns an iterator in Python 3.0 and a list in 2.x minver = list(map(int, '2.5'.split('.'))) + [0, 0, 0] minverhex = 0 # xrange is not present in Python 3.0 and range returns an iterator for i in list(range(0, 4)): minverhex = (minverhex << 8) + minver[i] sys.exit(sys.hexversion < minverhex)
configure:6989: $? = 0
configure:6995: result: python
configure:7003: checking for python
configure:7021: found /usr/bin/python
configure:7033: result: /usr/bin/python
configure:7051: checking for python version
configure:7058: result: 2.7
configure:7070: checking for python platform
configure:7077: result: linux2
configure:7103: checking for python script directory
configure:7138: result: ${prefix}/lib/python2.7/dist-packages
configure:7147: checking for python extension module directory
configure:7182: result: ${exec_prefix}/lib/python2.7/dist-packages
configure:7318: checking for libiconv_open in -liconv
configure:7343: /home/mpfj/buildroot-bt/output/host/usr/bin/arm-buildroot-linux-uclibcgnueabi-gcc -o conftest   -pipe -Os    conftest.c -liconv   >&5
configure:7343: $? = 0
configure:7352: result: yes
configure:7417: checking whether to cache iconv descriptors
configure:7439: result: no
configure:7445: checking for ZLIB
configure:7452: $PKG_CONFIG --exists --print-errors "zlib"
configure:7455: $? = 0
configure:7469: $PKG_CONFIG --exists --print-errors "zlib"
configure:7472: $? = 0
configure:7510: result: yes
configure:7514: checking for ANSI C header files
configure:7534: /home/mpfj/buildroot-bt/output/host/usr/bin/arm-buildroot-linux-uclibcgnueabi-gcc -c   -pipe -Os   conftest.c >&5
configure:7534: $? = 0
configure:7618: result: yes
configure:7631: checking for sys/types.h
configure:7631: /home/mpfj/buildroot-bt/output/host/usr/bin/arm-buildroot-linux-uclibcgnueabi-gcc -c   -pipe -Os   conftest.c >&5
configure:7631: $? = 0
configure:7631: result: yes
configure:7631: checking for sys/stat.h
configure:7631: /home/mpfj/buildroot-bt/output/host/usr/bin/arm-buildroot-linux-uclibcgnueabi-gcc -c   -pipe -Os   conftest.c >&5
configure:7631: $? = 0
configure:7631: result: yes
configure:7631: checking for stdlib.h
configure:7631: /home/mpfj/buildroot-bt/output/host/usr/bin/arm-buildroot-linux-uclibcgnueabi-gcc -c   -pipe -Os   conftest.c >&5
configure:7631: $? = 0
configure:7631: result: yes
configure:7631: checking for string.h
configure:7631: /home/mpfj/buildroot-bt/output/host/usr/bin/arm-buildroot-linux-uclibcgnueabi-gcc -c   -pipe -Os   conftest.c >&5
configure:7631: $? = 0
configure:7631: result: yes
configure:7631: checking for memory.h
configure:7631: /home/mpfj/buildroot-bt/output/host/usr/bin/arm-buildroot-linux-uclibcgnueabi-gcc -c   -pipe -Os   conftest.c >&5
configure:7631: $? = 0
configure:7631: result: yes
configure:7631: checking for strings.h
configure:7631: /home/mpfj/buildroot-bt/output/host/usr/bin/arm-buildroot-linux-uclibcgnueabi-gcc -c   -pipe -Os   conftest.c >&5
configure:7631: $? = 0
configure:7631: result: yes
configure:7631: checking for inttypes.h
configure:7631: /home/mpfj/buildroot-bt/output/host/usr/bin/arm-buildroot-linux-uclibcgnueabi-gcc -c   -pipe -Os   conftest.c >&5
configure:7631: $? = 0
configure:7631: result: yes
configure:7631: checking for stdint.h
configure:7631: /home/mpfj/buildroot-bt/output/host/usr/bin/arm-buildroot-linux-uclibcgnueabi-gcc -c   -pipe -Os   conftest.c >&5
configure:7631: $? = 0
configure:7631: result: yes
configure:7631: checking for unistd.h
configure:7631: /home/mpfj/buildroot-bt/output/host/usr/bin/arm-buildroot-linux-uclibcgnueabi-gcc -c   -pipe -Os   conftest.c >&5
configure:7631: $? = 0
configure:7631: result: yes
configure:7700: checking for LIBFFI
configure:7707: $PKG_CONFIG --exists --print-errors "libffi >= 3.0.0"
Package libffi was not found in the pkg-config search path.
Perhaps you should add the directory containing `libffi.pc'
to the PKG_CONFIG_PATH environment variable
No package 'libffi' found
configure:7710: $? = 1
configure:7724: $PKG_CONFIG --exists --print-errors "libffi >= 3.0.0"
Package libffi was not found in the pkg-config search path.
Perhaps you should add the directory containing `libffi.pc'
to the PKG_CONFIG_PATH environment variable
No package 'libffi' found
configure:7727: $? = 1
configure:7741: result: no
Package libffi was not found in the pkg-config search path.
Perhaps you should add the directory containing `libffi.pc'
to the PKG_CONFIG_PATH environment variable
No package 'libffi' found
configure:7757: error: Package requirements (libffi >= 3.0.0) were not met:

Package libffi was not found in the pkg-config search path.
Perhaps you should add the directory containing `libffi.pc'
to the PKG_CONFIG_PATH environment variable
No package 'libffi' found

Consider adjusting the PKG_CONFIG_PATH environment variable if you
installed software in a non-standard prefix.

Alternatively, you may set the environment variables LIBFFI_CFLAGS
and LIBFFI_LIBS to avoid the need to call pkg-config.
See the pkg-config man page for more details.

## ---------------- ##
## Cache variables. ##
## ---------------- ##

ac_cv_build=x86_64-unknown-linux-gnu
ac_cv_c_bigendian=no
ac_cv_c_compiler_gnu=yes
ac_cv_cxx_compiler_gnu=yes
ac_cv_env_CCC_set=
ac_cv_env_CCC_value=
ac_cv_env_CC_set=set
ac_cv_env_CC_value=/home/mpfj/buildroot-bt/output/host/usr/bin/arm-buildroot-linux-uclibcgnueabi-gcc
ac_cv_env_CFLAGS_set=set
ac_cv_env_CFLAGS_value='  -pipe -Os '
ac_cv_env_CPPFLAGS_set=set
ac_cv_env_CPPFLAGS_value=
ac_cv_env_CPP_set=set
ac_cv_env_CPP_value=/home/mpfj/buildroot-bt/output/host/usr/bin/arm-buildroot-linux-uclibcgnueabi-cpp
ac_cv_env_CXXCPP_set=
ac_cv_env_CXXCPP_value=
ac_cv_env_CXXFLAGS_set=set
ac_cv_env_CXXFLAGS_value='  -pipe -Os '
ac_cv_env_CXX_set=set
ac_cv_env_CXX_value=/home/mpfj/buildroot-bt/output/host/usr/bin/arm-buildroot-linux-uclibcgnueabi-g++
ac_cv_env_DBUS1_CFLAGS_set=
ac_cv_env_DBUS1_CFLAGS_value=
ac_cv_env_DBUS1_LIBS_set=
ac_cv_env_DBUS1_LIBS_value=
ac_cv_env_LDFLAGS_set=set
ac_cv_env_LDFLAGS_value=
ac_cv_env_LIBELF_CFLAGS_set=
ac_cv_env_LIBELF_CFLAGS_value=
ac_cv_env_LIBELF_LIBS_set=
ac_cv_env_LIBELF_LIBS_value=
ac_cv_env_LIBFFI_CFLAGS_set=
ac_cv_env_LIBFFI_CFLAGS_value=
ac_cv_env_LIBFFI_LIBS_set=
ac_cv_env_LIBFFI_LIBS_value=
ac_cv_env_LIBS_set=
ac_cv_env_LIBS_value=
ac_cv_env_PCRE_CFLAGS_set=
ac_cv_env_PCRE_CFLAGS_value=
ac_cv_env_PCRE_LIBS_set=
ac_cv_env_PCRE_LIBS_value=
ac_cv_env_PKG_CONFIG_LIBDIR_set=
ac_cv_env_PKG_CONFIG_LIBDIR_value=
ac_cv_env_PKG_CONFIG_PATH_set=
ac_cv_env_PKG_CONFIG_PATH_value=
ac_cv_env_PKG_CONFIG_set=set
ac_cv_env_PKG_CONFIG_value=/home/mpfj/buildroot-bt/output/host/usr/bin/pkg-config
ac_cv_env_PYTHON_set=
ac_cv_env_PYTHON_value=
ac_cv_env_ZLIB_CFLAGS_set=
ac_cv_env_ZLIB_CFLAGS_value=
ac_cv_env_ZLIB_LIBS_set=
ac_cv_env_ZLIB_LIBS_value=
ac_cv_env_build_alias_set=set
ac_cv_env_build_alias_value=x86_64-unknown-linux-gnu
ac_cv_env_host_alias_set=set
ac_cv_env_host_alias_value=arm-buildroot-linux-uclibcgnueabi
ac_cv_env_target_alias_set=set
ac_cv_env_target_alias_value=arm-buildroot-linux-uclibcgnueabi
ac_cv_func_calloc_0_nonnull=yes
ac_cv_func_chown_works=yes
ac_cv_func_closedir_void=no
ac_cv_func_euidaccess=no
ac_cv_func_fnmatch_gnu=yes
ac_cv_func_getcwd_null=yes
ac_cv_func_getdelim=yes
ac_cv_func_getgroups=yes
ac_cv_func_getgroups_works=yes
ac_cv_func_getloadavg=no
ac_cv_func_lstat_dereferences_slashed_symlink=yes
ac_cv_func_lstat_empty_string_bug=no
ac_cv_func_malloc_0_nonnull=yes
ac_cv_func_memcmp_working=yes
ac_cv_func_mkstemp=yes
ac_cv_func_mmap_fixed_mapped=yes
ac_cv_func_newlocale=no
ac_cv_func_posix_getgrgid_r=no
ac_cv_func_posix_getpwuid_r=yes
ac_cv_func_printf_unix98=yes
ac_cv_func_realloc_0_nonnull=yes
ac_cv_func_stat_empty_string_bug=no
ac_cv_func_strerror_r_char_p=no
ac_cv_func_strnlen_working=yes
ac_cv_func_strtod=yes
ac_cv_func_strtod_l=no
ac_cv_func_strtoll_l=no
ac_cv_func_strtoull_l=no
ac_cv_func_uselocale=no
ac_cv_func_utime_null=yes
ac_cv_func_vsnprintf_c99=yes
ac_cv_func_working_mktime=yes
ac_cv_gnu_library_2_1=yes
ac_cv_have_decl_euidaccess=no
ac_cv_have_decl_malloc=yes
ac_cv_have_decl_nanosleep=yes
ac_cv_have_decl_strerror_r=yes
ac_cv_have_decl_strnlen=yes
ac_cv_header_inttypes_h=yes
ac_cv_header_memory_h=yes
ac_cv_header_stdc=yes
ac_cv_header_stdint_h=yes
ac_cv_header_stdlib_h=yes
ac_cv_header_string_h=yes
ac_cv_header_strings_h=yes
ac_cv_header_sys_stat_h=yes
ac_cv_header_sys_types_h=yes
ac_cv_header_unistd_h=yes
ac_cv_host=arm-buildroot-linux-uclibcgnueabi
ac_cv_lbl_unaligned_fail=yes
ac_cv_lib_getloadavg_getloadavg=no
ac_cv_lib_iconv_libiconv_open=yes
ac_cv_lib_util_getloadavg=no
ac_cv_objext=o
ac_cv_path_EGREP='/bin/grep -E'
ac_cv_path_GLIB_GENMARSHAL=/home/mpfj/buildroot-bt/output/host/usr/bin/glib-genmarshal
ac_cv_path_GREP=/bin/grep
ac_cv_path_PERL_PATH=/usr/bin/perl
ac_cv_path_PYTHON=/usr/bin/python
ac_cv_path_install='/usr/bin/install -c'
ac_cv_path_mkdir=/bin/mkdir
ac_cv_prog_AWK=mawk
ac_cv_prog_CC=/home/mpfj/buildroot-bt/output/host/usr/bin/arm-buildroot-linux-uclibcgnueabi-gcc
ac_cv_prog_CPP=/home/mpfj/buildroot-bt/output/host/usr/bin/arm-buildroot-linux-uclibcgnueabi-cpp
ac_cv_prog_CXX=/home/mpfj/buildroot-bt/output/host/usr/bin/arm-buildroot-linux-uclibcgnueabi-g++
ac_cv_prog_F77=no
ac_cv_prog_PERL=perl
ac_cv_prog_STRIP=/home/mpfj/buildroot-bt/output/host/usr/bin/arm-buildroot-linux-uclibcgnueabi-strip
ac_cv_prog_cc__home_mpfj_buildroot_bt_output_host_usr_bin_arm_buildroot_linux_uclibcgnueabi_gcc_c_o=yes
ac_cv_prog_cc_c89=
ac_cv_prog_cc_g=yes
ac_cv_prog_cxx_g=yes
ac_cv_prog_make_make_set=yes
ac_cv_struct_st_mtim_nsec=no
am_cv_CC_dependencies_compiler_type=gcc3
am_cv_CXX_dependencies_compiler_type=gcc3
am_cv_func_working_getline=yes
am_cv_make_support_nested_variables=yes
am_cv_pathless_PYTHON=python
am_cv_prog_tar_ustar=gnutar
am_cv_python_platform=linux2
am_cv_python_pyexecdir='${exec_prefix}/lib/python2.7/dist-packages'
am_cv_python_pythondir='${prefix}/lib/python2.7/dist-packages'
am_cv_python_version=2.7
fu_cv_sys_stat_statfs2_bsize=yes
gl_cv_c_restrict=no
gl_cv_func_getcwd_null=yes
gl_cv_func_getcwd_path_max=yes
gl_cv_func_malloc_0_nonnull=yes
gl_cv_func_mkdir_trailing_slash_bug=no
gl_cv_func_mkstemp_limitations=no
gl_cv_func_tzset_clobber=no
gl_cv_func_working_readdir=yes
gl_cv_func_working_utimes=yes
glib_cv_have_qsort_r=yes
glib_cv_long_long_format=ll
glib_cv_stack_grows=no
glib_cv_uscore=no
gt_cv_c_wchar_t=yes
jm_ac_cv_func_link_follows_symlink=no
jm_cv_func_gettimeofday_clobber=no
jm_cv_func_nanosleep_works=yes
jm_cv_func_svid_putenv=yes
jm_cv_func_working_re_compile_pattern=yes
lt_cv_sys_lib_search_path_spec=
pkg_cv_ZLIB_CFLAGS='-I/home/mpfj/buildroot/output/host/usr/arm-buildroot-linux-uclibcgnueabi/sysroot/usr/include  '
pkg_cv_ZLIB_LIBS='-L/home/mpfj/buildroot/output/host/usr/arm-buildroot-linux-uclibcgnueabi/sysroot/usr/lib -lz  '
utils_cv_func_mkdir_trailing_slash_bug=no
utils_cv_func_mkstemp_limitations=no
utils_cv_localtime_cache=no
vb_cv_func_rename_trailing_slash_bug=no

## ----------------- ##
## Output variables. ##
## ----------------- ##

ABS_GLIB_RUNTIME_LIBDIR=''
ABS_TAPSET_DIR=''
ACLOCAL='${SHELL} /home/mpfj/buildroot-bt/output/build/libglib2-2.36.3/missing --run aclocal-1.12'
ALLOCA=''
AMDEPBACKSLASH='\'
AMDEP_FALSE='#'
AMDEP_TRUE=''
AMTAR='$${TAR-tar}'
AM_BACKSLASH='\'
AM_DEFAULT_V='$(AM_DEFAULT_VERBOSITY)'
AM_DEFAULT_VERBOSITY='0'
AM_V='$(V)'
AR='/home/mpfj/buildroot-bt/output/host/usr/bin/arm-buildroot-linux-uclibcgnueabi-ar'
AS='/home/mpfj/buildroot-bt/output/host/usr/bin/arm-buildroot-linux-uclibcgnueabi-as'
AUTOCONF='${SHELL} /home/mpfj/buildroot-bt/output/build/libglib2-2.36.3/missing --run autoconf'
AUTOHEADER='${SHELL} /home/mpfj/buildroot-bt/output/build/libglib2-2.36.3/missing --run autoheader'
AUTOMAKE='${SHELL} /home/mpfj/buildroot-bt/output/build/libglib2-2.36.3/missing --run automake-1.12'
AWK='mawk'
BUILD_MODULAR_TESTS_FALSE=''
BUILD_MODULAR_TESTS_TRUE='#'
CATALOGS=''
CATOBJEXT=''
CC='/home/mpfj/buildroot-bt/output/host/usr/bin/arm-buildroot-linux-uclibcgnueabi-gcc'
CCDEPMODE='depmode=gcc3'
CFLAGS='  -pipe -Os '
CONFIG_STATUS_DEPENDENCIES=''
CPP='/home/mpfj/buildroot-bt/output/host/usr/bin/arm-buildroot-linux-uclibcgnueabi-cpp'
CPPFLAGS=''
CROSS_COMPILING_FALSE=''
CROSS_COMPILING_TRUE=''
CXX='/home/mpfj/buildroot-bt/output/host/usr/bin/arm-buildroot-linux-uclibcgnueabi-g++'
CXXCPP=''
CXXDEPMODE='depmode=gcc3'
CXXFLAGS='  -pipe -Os '
CYGPATH_W='echo'
DATADIRNAME=''
DBUS1_CFLAGS=''
DBUS1_LIBS=''
DBUS_DAEMON=''
DEFS=''
DEPDIR='.deps'
DLLTOOL=''
DSYMUTIL=''
DTRACE=''
DUMPBIN=''
ECHO_C=''
ECHO_N='-n'
ECHO_T=''
EGREP='/bin/grep -E'
ENABLE_DTRACE_FALSE=''
ENABLE_DTRACE_TRUE=''
ENABLE_GTK_DOC_FALSE=''
ENABLE_GTK_DOC_TRUE=''
ENABLE_MAN_FALSE=''
ENABLE_MAN_TRUE=''
ENABLE_SYSTEMTAP_FALSE=''
ENABLE_SYSTEMTAP_TRUE=''
ENABLE_TIMELOOP_FALSE=''
ENABLE_TIMELOOP_TRUE=''
EXEEXT=''
FAM_LIBS=''
FGREP=''
GETTEXT_PACKAGE=''
GIO=''
GIO_MODULE_DIR=''
GLIBC21='yes'
GLIB_BINARY_AGE='3603'
GLIB_COMPILE_RESOURCES=''
GLIB_COMPILE_SCHEMAS=''
GLIB_DEBUG_FLAGS='-DG_DISABLE_CAST_CHECKS'
GLIB_EXTRA_CFLAGS=''
GLIB_GENMARSHAL=''
GLIB_HIDDEN_VISIBILITY_CFLAGS=''
GLIB_INTERFACE_AGE='3'
GLIB_LINK_FLAGS=''
GLIB_MAJOR_VERSION='2'
GLIB_MICRO_VERSION='3'
GLIB_MINOR_VERSION='36'
GLIB_RUNTIME_LIBDIR=''
GLIB_VERSION='2.36.3'
GLIB_WARN_CFLAGS=''
GLIB_WIN32_STATIC_COMPILATION_DEFINE=''
GMOFILES=''
GMSGFMT=''
GREP='/bin/grep'
GSPAWN=''
GTHREAD_COMPILE_IMPL_DEFINES=''
GTKDOC_CHECK=''
GTKDOC_MKPDF=''
GTKDOC_REBASE=''
GTK_DOC_BUILD_HTML_FALSE=''
GTK_DOC_BUILD_HTML_TRUE=''
GTK_DOC_BUILD_PDF_FALSE=''
GTK_DOC_BUILD_PDF_TRUE=''
GTK_DOC_USE_LIBTOOL_FALSE=''
GTK_DOC_USE_LIBTOOL_TRUE=''
GTK_DOC_USE_REBASE_FALSE=''
GTK_DOC_USE_REBASE_TRUE=''
G_LIBS_EXTRA=''
G_MODULE_BROKEN_RTLD_GLOBAL=''
G_MODULE_HAVE_DLERROR=''
G_MODULE_IMPL=''
G_MODULE_LDFLAGS=''
G_MODULE_LIBS=''
G_MODULE_LIBS_EXTRA=''
G_MODULE_NEED_USCORE=''
G_MODULE_PLUGIN_LIBS=''
G_MODULE_SUPPORTED=''
G_THREAD_CFLAGS=''
G_THREAD_LIBS=''
G_THREAD_LIBS_EXTRA=''
G_THREAD_LIBS_FOR_GTHREAD=''
HAVE_CXX_FALSE='#'
HAVE_CXX_TRUE=''
HAVE_DBUS1_FALSE=''
HAVE_DBUS1_TRUE=''
HAVE_DBUS_DAEMON_FALSE=''
HAVE_DBUS_DAEMON_TRUE=''
HAVE_EVENTFD_FALSE=''
HAVE_EVENTFD_TRUE=''
HAVE_FAM_FALSE=''
HAVE_FAM_TRUE=''
HAVE_FEN_FALSE=''
HAVE_FEN_TRUE=''
HAVE_GCC_FALSE='#'
HAVE_GCC_TRUE=''
HAVE_GLIB_RUNTIME_LIBDIR_FALSE=''
HAVE_GLIB_RUNTIME_LIBDIR_TRUE='#'
HAVE_GNUC_VISIBILITY_FALSE=''
HAVE_GNUC_VISIBILITY_TRUE=''
HAVE_GOOD_PRINTF_FALSE=''
HAVE_GOOD_PRINTF_TRUE=''
HAVE_INOTIFY_FALSE=''
HAVE_INOTIFY_TRUE=''
HAVE_KQUEUE_FALSE=''
HAVE_KQUEUE_TRUE=''
HAVE_NETLINK_FALSE=''
HAVE_NETLINK_TRUE=''
HAVE_SUNSTUDIO_VISIBILITY_FALSE=''
HAVE_SUNSTUDIO_VISIBILITY_TRUE=''
HTML_DIR=''
ICONV_LIBS=''
INDENT=''
INSTALL_DATA='${INSTALL} -m 644'
INSTALL_PROGRAM='${INSTALL}'
INSTALL_SCRIPT='${INSTALL}'
INSTALL_STRIP_PROGRAM='$(install_sh) -c -s'
INSTOBJEXT=''
INTLLIBS=''
LD='/home/mpfj/buildroot-bt/output/host/usr/bin/arm-buildroot-linux-uclibcgnueabi-ld'
LDFLAGS=''
LIBELF_CFLAGS=''
LIBELF_LIBS=''
LIBFFI_CFLAGS=''
LIBFFI_LIBS=''
LIBOBJS=''
LIBS=''
LIBTOOL=''
LIB_EXE_MACHINE_FLAG='X86'
LIPO=''
LN_S=''
LTLIBOBJS=''
LTP=''
LTP_GENHTML=''
LT_AGE='3600'
LT_CURRENT='3600'
LT_CURRENT_MINUS_AGE='0'
LT_RELEASE='2.36'
LT_REVISION='3'
MAINT=''
MAINTAINER_MODE_FALSE='#'
MAINTAINER_MODE_TRUE=''
MAKEINFO='${SHELL} /home/mpfj/buildroot-bt/output/build/libglib2-2.36.3/missing --run makeinfo'
MANIFEST_TOOL=''
MKDIR_P='/bin/mkdir -p'
MKINSTALLDIRS=''
MSGFMT=''
MSGFMT_OPTS=''
MS_LIB_AVAILABLE_FALSE=''
MS_LIB_AVAILABLE_TRUE='#'
NAMESER_COMPAT_INCLUDE=''
NETWORK_LIBS=''
NM='/home/mpfj/buildroot-bt/output/host/usr/bin/arm-buildroot-linux-uclibcgnueabi-nm'
NMEDIT=''
OBJDUMP='/home/mpfj/buildroot-bt/output/host/usr/bin/arm-buildroot-linux-uclibcgnueabi-objdump'
OBJEXT='o'
OS_CARBON_FALSE=''
OS_CARBON_TRUE='#'
OS_COCOA_FALSE=''
OS_COCOA_TRUE='#'
OS_LINUX_FALSE='#'
OS_LINUX_TRUE=''
OS_UNIX_FALSE='#'
OS_UNIX_TRUE=''
OS_WIN32_AND_DLL_COMPILATION_FALSE=''
OS_WIN32_AND_DLL_COMPILATION_TRUE=''
OS_WIN32_FALSE=''
OS_WIN32_TRUE='#'
OS_WIN32_X64_FALSE=''
OS_WIN32_X64_TRUE='#'
OTOOL64=''
OTOOL=''
PACKAGE='glib'
PACKAGE_BUGREPORT='http://bugzilla.gnome.org/enter_bug.cgi?product=glib'
PACKAGE_NAME='glib'
PACKAGE_STRING='glib 2.36.3'
PACKAGE_TARNAME='glib'
PACKAGE_URL=''
PACKAGE_VERSION='2.36.3'
PATH_SEPARATOR=':'
PCRE_CFLAGS=''
PCRE_LIBS=''
PCRE_REQUIRES=''
PCRE_WARN_CFLAGS=''
PERL='perl'
PERL_PATH='/usr/bin/perl'
PKG_CONFIG='/home/mpfj/buildroot-bt/output/host/usr/bin/pkg-config'
PKG_CONFIG_LIBDIR=''
PKG_CONFIG_PATH=''
PLATFORMDEP=''
PLATFORM_WIN32_FALSE=''
PLATFORM_WIN32_TRUE=''
POFILES=''
POSUB=''
PO_IN_DATADIR_FALSE=''
PO_IN_DATADIR_TRUE=''
PYTHON='/usr/bin/python'
PYTHON_EXEC_PREFIX='${exec_prefix}'
PYTHON_PLATFORM='linux2'
PYTHON_PREFIX='${prefix}'
PYTHON_VERSION='2.7'
RANLIB='/home/mpfj/buildroot-bt/output/host/usr/bin/arm-buildroot-linux-uclibcgnueabi-ranlib'
REBUILD=''
SED=''
SELINUX_LIBS=''
SET_MAKE=''
SHELL='/bin/bash'
SHTOOL=''
STRIP='/home/mpfj/buildroot-bt/output/host/usr/bin/arm-buildroot-linux-uclibcgnueabi-strip'
USE_NLS=''
USE_SYSTEM_PCRE_FALSE=''
USE_SYSTEM_PCRE_TRUE=''
VERSION='2.36.3'
WINDRES=''
WSPIAPI_INCLUDE=''
XATTR_LIBS=''
XGETTEXT=''
XMLCATALOG=''
XML_CATALOG_FILE=''
XSLTPROC=''
ZLIB_CFLAGS='-I/home/mpfj/buildroot/output/host/usr/arm-buildroot-linux-uclibcgnueabi/sysroot/usr/include  '
ZLIB_LIBS='-L/home/mpfj/buildroot/output/host/usr/arm-buildroot-linux-uclibcgnueabi/sysroot/usr/lib -lz  '
ac_ct_AR=''
ac_ct_CC=''
ac_ct_CXX=''
ac_ct_DUMPBIN=''
am__EXEEXT_FALSE=''
am__EXEEXT_TRUE=''
am__fastdepCC_FALSE='#'
am__fastdepCC_TRUE=''
am__fastdepCXX_FALSE='#'
am__fastdepCXX_TRUE=''
am__include='include'
am__isrc=''
am__leading_dot='.'
am__nodep='_no'
am__quote=''
am__tar='tar --format=ustar -chf - "$$tardir"'
am__untar='tar -xf -'
bindir='${exec_prefix}/bin'
build='x86_64-unknown-linux-gnu'
build_alias='x86_64-unknown-linux-gnu'
build_cpu='x86_64'
build_os='linux-gnu'
build_vendor='unknown'
config_h_INCLUDES=''
datadir='${datarootdir}'
datarootdir='${prefix}/share'
docdir='${datarootdir}/doc/${PACKAGE_TARNAME}'
dvidir='${docdir}'
exec_prefix='/usr'
gio_INCLUDES=''
glib_INCLUDES=''
gmodule_INCLUDES=''
gobject_INCLUDES=''
host='arm-buildroot-linux-uclibcgnueabi'
host_alias='arm-buildroot-linux-uclibcgnueabi'
host_cpu='arm'
host_os='linux-uclibcgnueabi'
host_vendor='buildroot'
htmldir='${docdir}'
includedir='${prefix}/include'
infodir='${datarootdir}/info'
install_sh='${SHELL} /home/mpfj/buildroot-bt/output/build/libglib2-2.36.3/install-sh'
libdir='${exec_prefix}/lib'
libexecdir='${exec_prefix}/libexec'
localedir='${datarootdir}/locale'
localstatedir='${prefix}/var'
mandir='${datarootdir}/man'
mkdir_p='$(MKDIR_P)'
ms_librarian=''
oldincludedir='/usr/include'
pdfdir='${docdir}'
pkgpyexecdir='${pyexecdir}/glib'
pkgpythondir='${pythondir}/glib'
prefix='/usr'
program_transform_name='s&^&&'
psdir='${docdir}'
pyexecdir='${exec_prefix}/lib/python2.7/dist-packages'
pythondir='${prefix}/lib/python2.7/dist-packages'
sbindir='${exec_prefix}/sbin'
sharedstatedir='${prefix}/com'
sysconfdir='/etc'
target_alias='arm-buildroot-linux-uclibcgnueabi'

## ----------- ##
## confdefs.h. ##
## ----------- ##

/* confdefs.h */
#define PACKAGE_NAME "glib"
#define PACKAGE_TARNAME "glib"
#define PACKAGE_VERSION "2.36.3"
#define PACKAGE_STRING "glib 2.36.3"
#define PACKAGE_BUGREPORT "http://bugzilla.gnome.org/enter_bug.cgi?product=glib"
#define PACKAGE_URL ""
#define GLIB_MAJOR_VERSION 2
#define GLIB_MINOR_VERSION 36
#define GLIB_MICRO_VERSION 3
#define GLIB_INTERFACE_AGE 3
#define GLIB_BINARY_AGE 3603
#define _GNU_SOURCE 1
#define STDC_HEADERS 1
#define HAVE_SYS_TYPES_H 1
#define HAVE_SYS_STAT_H 1
#define HAVE_STDLIB_H 1
#define HAVE_STRING_H 1
#define HAVE_MEMORY_H 1
#define HAVE_STRINGS_H 1
#define HAVE_INTTYPES_H 1
#define HAVE_STDINT_H 1
#define HAVE_UNISTD_H 1

configure: exit 1

New paste


Private
Wrap long lines

1 + 4 =